Add support for daily frequency in mdbnomics2dseries conversion.

3 jobs for master in 3 minutes and 38 seconds (queued for 3 seconds)
Status Job ID Name Coverage
  Test
failed #19356
test_matlab

00:01:03

failed #19358
test_octave

00:03:38

failed #19357
test_old_matlab

00:01:20

 
Name Stage Failure
failed
test_octave Test
/home/gitlab-runner/builds/yfD11P3_/0/DoraK/dseries/tests/../src/utilities/x13/printspan.m                                        Unit test number  2  PASS    [   0.006989 ]
/home/gitlab-runner/builds/yfD11P3_/0/DoraK/dseries/tests/../src/utilities/x13/printspan.m Unit test number 3 PASS [ 0.00657392 ]
/home/gitlab-runner/builds/yfD11P3_/0/DoraK/dseries/tests/../src/utilities/x13/printstart.m Unit test number 1 PASS [ 0.00526786 ]
/home/gitlab-runner/builds/yfD11P3_/0/DoraK/dseries/tests/../src/utilities/x13/setdefaultmember.m Unit test number 1 PASS [ 0.00328684 ]

make: *** [Makefile:10: check-octave] Error 1
Running after_script
Uploading artifacts for failed job
ERROR: Job failed: exit status 1
failed
test_old_matlab Test
/home/gitlab-runner/builds/79277319/0/DoraK/dseries/tests/../src/utilities/x13/printspan.m                                        Unit test number  2  PASS    [ 0.003449 ]
/home/gitlab-runner/builds/79277319/0/DoraK/dseries/tests/../src/utilities/x13/printspan.m Unit test number 3 PASS [ 0.003169 ]
/home/gitlab-runner/builds/79277319/0/DoraK/dseries/tests/../src/utilities/x13/printstart.m Unit test number 1 PASS [ 0.002941 ]
/home/gitlab-runner/builds/79277319/0/DoraK/dseries/tests/../src/utilities/x13/setdefaultmember.m Unit test number 1 PASS [ 0.003096 ]

make: *** [Makefile:14: check-matlab] Error 1
Running after_script
Uploading artifacts for failed job
ERROR: Job failed: exit status 1
failed
test_matlab Test
    '/home/gitlab-runner/builds/2084817d/0/DoraK/dseries/src/utilities/x13/printspan.m                                        Unit test number  2  PASS    [  0.00457 ]'
'/home/gitlab-runner/builds/2084817d/0/DoraK/dseries/src/utilities/x13/printspan.m Unit test number 3 PASS [ 0.004309 ]'
'/home/gitlab-runner/builds/2084817d/0/DoraK/dseries/src/utilities/x13/printstart.m Unit test number 1 PASS [ 0.003987 ]'
'/home/gitlab-runner/builds/2084817d/0/DoraK/dseries/src/utilities/x13/setdefaultmember.m Unit test number 1 PASS [ 0.003291 ]'

make: *** [Makefile:14: check-matlab] Error 1
Running after_script
Uploading artifacts for failed job
ERROR: Job failed: exit status 1