Onx

3 jobs for master in 12 seconds (queued for 2 seconds)
Status Job ID Name Coverage
  Test
failed #6452
testsuite_matlab

00:00:12

failed #6454
allowed to fail
testsuite_octave

00:00:08

failed #6453
allowed to fail
testsuite_old_matlab

00:00:05

 
Name Stage Failure
failed
testsuite_matlab Test

Error in run_unitary_tests_in_directory (line 69)
[report, time] = run_unitary_tests(listoffiles);

Error in runalltests (line 53)
r = run_unitary_tests_in_directory(dseries_src_root(1:end-1));
}
make: *** [Makefile:14: check-matlab] Error 1
ERROR: Job failed: exit status 1
failed
testsuite_octave Test
parse error near line 7 of file /home/gitlab-runner/builds/2084817d/0/sebastien/dseries/tests/dseries_test_3.m

syntax error

>>> ts = dseries([ dseries_src_root filesep 'tests' filesep 'data' filesep 'dynseries_test_data.m');
^

make: *** [Makefile:10: check-octave] Error 1
ERROR: Job failed: exit status 1
failed
testsuite_old_matlab Test

Error in ==> run_unitary_tests_in_directory at 69
[report, time] = run_unitary_tests(listoffiles);

Error in ==> runalltests at 53
r = run_unitary_tests_in_directory(dseries_src_root(1:end-1));
}
>> make: *** [Makefile:14: check-matlab] Error 1
ERROR: Job failed: exit status 1