Onx

4 jobs for master in 1 minute and 23 seconds
Status Job ID Name Coverage
  Test
failed #6455
testsuite_matlab

00:00:43

failed #6457
allowed to fail
testsuite_octave

00:01:22

failed #6458
allowed to fail
testsuite_old_matlab

00:00:47

failed #6456
allowed to fail
testsuite_old_matlab

00:00:01

 
Name Stage Failure
failed
testsuite_octave Test
/home/gitlab-runner/builds/2084817d/0/sebastien/dseries/tests/../src/utilities/x13/printoption.m                                      Unit test number  1  PASS    [  0.0239701 ]
/home/gitlab-runner/builds/2084817d/0/sebastien/dseries/tests/../src/utilities/x13/printspan.m Unit test number 1 PASS [ 0.0107889 ]
/home/gitlab-runner/builds/2084817d/0/sebastien/dseries/tests/../src/utilities/x13/printspan.m Unit test number 2 PASS [ 0.00999284 ]
/home/gitlab-runner/builds/2084817d/0/sebastien/dseries/tests/../src/utilities/x13/printspan.m Unit test number 3 PASS [ 0.00951791 ]
/home/gitlab-runner/builds/2084817d/0/sebastien/dseries/tests/../src/utilities/x13/printstart.m Unit test number 1 PASS [ 0.00804305 ]
/home/gitlab-runner/builds/2084817d/0/sebastien/dseries/tests/../src/utilities/x13/setdefaultmember.m Unit test number 1 PASS [ 0.00571084 ]

make: *** [Makefile:10: check-octave] Error 1
ERROR: Job failed: exit status 1
failed
testsuite_old_matlab Test
/home/gitlab-runner/builds/a354a37e/0/sebastien/dseries/tests/../src/utilities/x13/printoption.m                                      Unit test number  1  PASS    [ 0.011961 ]
/home/gitlab-runner/builds/a354a37e/0/sebastien/dseries/tests/../src/utilities/x13/printspan.m Unit test number 1 PASS [ 0.004775 ]
/home/gitlab-runner/builds/a354a37e/0/sebastien/dseries/tests/../src/utilities/x13/printspan.m Unit test number 2 PASS [ 0.002817 ]
/home/gitlab-runner/builds/a354a37e/0/sebastien/dseries/tests/../src/utilities/x13/printspan.m Unit test number 3 PASS [ 0.002693 ]
/home/gitlab-runner/builds/a354a37e/0/sebastien/dseries/tests/../src/utilities/x13/printstart.m Unit test number 1 PASS [ 0.003241 ]
/home/gitlab-runner/builds/a354a37e/0/sebastien/dseries/tests/../src/utilities/x13/setdefaultmember.m Unit test number 1 PASS [ 0.002322 ]

make: *** [Makefile:14: check-matlab] Error 1
ERROR: Job failed: exit status 1
failed
testsuite_matlab Test
    '/home/gitlab-runner/builds/64f6c0e8/0/sebastien/dseries/src/utilities/x13/printoption.m                                      Unit test number  1  PASS    [ 0.007797 ]'
'/home/gitlab-runner/builds/64f6c0e8/0/sebastien/dseries/src/utilities/x13/printspan.m Unit test number 1 PASS [ 0.005673 ]'
'/home/gitlab-runner/builds/64f6c0e8/0/sebastien/dseries/src/utilities/x13/printspan.m Unit test number 2 PASS [ 0.003644 ]'
'/home/gitlab-runner/builds/64f6c0e8/0/sebastien/dseries/src/utilities/x13/printspan.m Unit test number 3 PASS [ 0.003247 ]'
'/home/gitlab-runner/builds/64f6c0e8/0/sebastien/dseries/src/utilities/x13/printstart.m Unit test number 1 PASS [ 0.003388 ]'
'/home/gitlab-runner/builds/64f6c0e8/0/sebastien/dseries/src/utilities/x13/setdefaultmember.m Unit test number 1 PASS [ 0.002742 ]'

make: *** [Makefile:14: check-matlab] Error 1
ERROR: Job failed: exit status 1